{"text_format":"1","workbook":"xlsx","n_sheets":7,"sheets":["Instructions","Data Entry","Events","Graph","Score Summary","Lookup","Lookup ORF"],"not_rendered":{"charts":1,"images":2,"macros":1,"external_links":0,"defined_names":13,"comments":0,"pivot_tables":0},"unopened":[],"bounds":{"document_bytes":16777216,"sheet_cells":100000,"rows_first":2000,"rows_last":500,"rows_between":2000,"halvings":0,"cell_chars":16384,"cell_head_chars":4096},"cells_cut":0,"cells_raw":0,"read":"whole","date_system":"1900"}

{"sheet":"Instructions","index":0,"n_rows":62,"n_cols":10,"rows_kept":62,"cut":false,"hidden":false,"merged":[[27,1,27,14],[21,1,21,14],[2,0,2,12],[17,1,17,14],[18,1,18,16],[19,1,19,14]]}
["Instructions for Using the Student Progress Monitoring Tool"]
[]
[]
["• Overview: This tool is intended to facilitate progress monitoring for students receiving interventions. "]
[null,"1. Progress monitoring data is entered on the \"Data Entry\" worksheet and intervention data is entered on the \"Events\" worksheet."]
[null,"2. There are multiple options to view student progress on the \"Graph\" worksheet."]
[null,"3. The \"Score Summary\" worksheet summarizes all students' current progress."]
[null,"4. Normative data for Oral Reading Fluency to assist with goal setting can be accessed on the \"Lookup\" worksheet."]
[]
["• General Instructions: The first time that you use the spreadsheet after downloading it, you will need to do two or three things to enable use."]
[null,"1. A \"Protected View\" message will appear above the formula line. Click on the \"Enable Editing\" button."]
[null,"2. After you enable editing, another message will appear \"Security Warning: Macros have been disabled.\" Click \"Enable Content.\""]
[null,"3. If you see a message such as \"Security Risk: Microsoft has blocked macros from running because the source of this file is untrusted\", "]
[null,"then follow the instructions shown at the very bottom of this page."]
[]
["• Data Entry Instructions: This worksheet is used to enter the basic information for each student you would like to monitor."]
[null,"1. Sample Data: Sample student data is included as a reference. Use the \"Clear Data\" button located at the bottom left of the Date Entry tab to erase all sample data."]
[null,"2. Goal Setting: Progress monitoring goals can be set as a Benchmark Goal and/or a National Rate of Improvement Goal. A Benchmark Goal represents the goal score for that student on the Benchmark Date. Note that a Benchmark Goal must have a corresponding Benchmark Date entered. A National Rate of Improvment Goal represents the average weekly improvement you hope to observe. "]
[null,"3. Intervention End Date: Intervention End Date represents the date by which you anticipate stopping (or re-evaluating) the student's intervention. Note that an Intervention End Date is required to graph student progress. "]
[null,"4. Group: The Group column is optional and can be utilized to evaluate group (or class) progress. Note that when evaluating group progress it is important that differences in measures and goals are considered. "]
{"$rows_left_out":43}
{"sheet":"Data Entry","index":1,"n_rows":34,"n_cols":91,"rows_kept":34,"cut":false,"hidden":false,"merged":[[0,6,0,7],[0,8,0,9],[0,81,0,82],[0,83,0,84],[0,85,0,86],[0,61,0,62],[0,63,0,64],[0,65,0,66],[0,67,0,68],[0,69,0,70],[0,51,0,52],[0,53,0,54],[0,55,0,56],[0,57,0,58],[0,59,0,60],[0,33,0,34],[0,87,0,88],[0,89,0,90],[0,71,0,72],[0,73,0,74],[0,75,0,76],[0,77,0,78],[0,79,0,80],[0,11,0,12],[0,13,0,14],[0,15,0,16],[0,17,0,18],[0,19,0,20],[0,21,0,22],[0,23,0,24],[0,25,0,26],[0,27,0,28],[0,29,0,30],[0,31,0,32],[0,47,0,48],[0,49,0,50],[0,35,0,36],[0,37,0,38],[0,39,0,40],[0,41,0,42],[0,43,0,44],[0,45,0,46]]}
[null,null,null,null,null,null,"Benchmark",null,"National Rate of Improvement",null,null,"Score #1",null,"Score #2",null,"Score #3",null,"Score #4",null,"Score #5",null,"Score #6",null,"Score #7",null,"Score #8",null,"Score #9",null,"Score #10",null,"Score #11",null,"Score #12",null,"Score #13",null,"Score #14",null,"Score #15",null,"Score #16",null,"Score #17",null,"Score #18",null,"Score #19",null,"Score #20",null,"Score #21",null,"Score #22",null,"Score #23",null,"Score #24",null,"Score #25",null,"Score #26",null,"Score #27",null,"Score #28",null,"Score #29",null,"Score #30",null,"Score #31",null,"Score #32",null,"Score #33",null,"Score #34",null,"Score #35",null,"Score #36",null,"Score #37",null,"Score #38",null,"Score #39",null,"Score #40"]
["Student #","Group (optional)","Last Name","First Name","Measure","Grade","Goal","Goal Date","Goal","Intervention End Date",null,"Date","Score","Date","Score","Date","Score","Date","Score","Date","Score","Date","Score","Date","Score","Date","Score","Date","Score","Date","Score","Date","Score","Date","Score","Date","Score","Date","Score","Date","Score","Date","Score","Date","Score","Date","Score","Date","Score","Date","Score","Date","Score","Date","Score","Date","Score","Date","Score","Date","Score","Date","Score","Date","Score","Date","Score","Date","Score","Date","Score","Date","Score","Date","Score","Date","Score","Date","Score","Date","Score","Date","Score","Date","Score","Date","Score","Date","Score","Date","Score"]
[1,null,"Student ","A","Computation",2,45,"2020-06-01",0.9,"2020-06-01",null,"2019-09-10",5,"2019-09-17",6,"2019-09-24",7,"2019-10-01",7,"2019-10-04",8,"2019-10-11",9,"2019-10-18",11,"2019-10-22",12,"2019-10-29",13,"2019-11-05",13,"2019-11-12",14,"2019-11-19",15,"2019-11-26",17,"2019-12-03",18,"2019-12-10",18,"2019-12-17",19,"2020-01-07",17,"2020-01-14",19,"2020-01-21",21,"2020-01-28",22,"2020-02-04",23,"2020-02-12",24,"2020-02-17",26,"2020-02-24",26,"2020-03-02",28,"2020-03-09",28,"2020-03-16",26,"2020-03-23",29,"2020-03-30",30,"2020-04-03",32,"2020-04-07",33,"2020-04-13",33,"2020-04-20",34,"2020-04-27",36,"2020-05-04",37,"2020-05-11",38,"2020-05-18",39,"2020-05-18",40,"2020-05-26",41,"2020-06-01",42]
[2,1,"Student ","B","Maze",3," "," ",0.9,"2020-06-02",null,"2019-09-10",10,"2019-09-17",11,"2019-09-26",11,"2019-09-30",12,"2019-10-03",13,"2019-10-11",15,"2019-10-18",15,"2019-10-22",14,"2019-10-29",15,"2019-11-05",16,"2019-11-12",17,"2019-11-19",19,"2019-11-26",20,"2019-12-03",21,"2019-12-10",23,"2019-12-17",23,"2020-01-07",23,"2020-01-14",25,"2020-01-21",26,"2020-01-28",27,"2020-02-04",28,"2020-02-12",29,"2020-02-17",30,"2020-02-24",30,"2020-03-02",31,"2020-03-09",32,"2020-03-16",33,"2020-03-23",34,"2020-03-30",35,"2020-04-03",36,"2020-04-07",38,"2020-04-13",39,"2020-04-20",40,"2020-04-27",41,"2020-05-04",42,"2020-05-11",43,"2020-05-18",44,"2020-05-18",45,"2020-05-26",46,"2020-06-02",48]
[3,1,"Student ","C","Maze",1,25,"2020-06-01",null," ",null,"2019-09-09",5,"2019-09-17",6,"2019-09-24",6,"2019-10-01",7,"2019-10-04",8,"2019-10-11",8,"2019-10-18",8,"2019-10-22",9,"2019-10-29",9,"2019-11-05",10,"2019-11-12",10,"2019-11-19",11,"2019-11-26",11,"2019-12-03",12,"2019-12-10",12,"2019-12-17",13,"2020-01-07",13,"2020-01-14",14,"2020-01-21",14,"2020-01-28",15,"2020-02-04",14,"2020-02-12",15,"2020-02-17",16,"2020-02-24",16,"2020-03-02",17,"2020-03-09",18,"2020-03-16",18,"2020-03-23",19,"2020-03-30",20,"2020-04-03",21,"2020-04-07",22,"2020-04-13",23,"2020-04-20",24,"2020-04-27",25,"2020-05-04",26,"2020-05-11",26,"2020-05-18",27,"2020-05-18",28,"2020-05-26",29,"2020-06-01",30]
[4," ","Student ","D","Digit Span",3,30,"2020-06-02",null," ",null,"2019-09-10",4,"2019-09-17",4,"2019-09-24",5,"2019-10-01",5,"2019-10-04",6,"2019-10-11",6,"2019-10-18",7,"2019-10-22",7,"2019-10-29",8,"2019-11-05",8,"2019-11-12",9,"2019-11-19",9,"2019-11-26",9,"2019-12-03",10,"2019-12-10",9,"2019-12-17",10,"2020-01-07",11,"2020-01-14",11,"2020-01-21",11,"2020-01-28",11,"2020-02-04",13,"2020-02-12",14,"2020-02-17",15,"2020-02-24",15,"2020-03-02",15,"2020-03-09",16,"2020-03-16",17,"2020-03-23",18,"2020-03-30",19,"2020-04-03",20,"2020-04-07",21,"2020-04-13",22,"2020-04-20",23,"2020-04-27",24,"2020-05-04",25,"2020-05-11",26,"2020-05-18",26,"2020-05-18",27,"2020-05-26",27,"2020-06-01",28]
[5,null,"Student ","E","Oral Reading Fluency",4,100,"2020-06-01",1.2,"2020-06-01",null,"2019-09-10",45,"2019-09-17",47,"2019-09-24",48,"2019-10-01",49,"2019-10-04",50,"2019-10-11",51,"2019-10-18",52,"2019-10-22",53,"2019-10-29",54,"2019-11-05",57,"2019-11-12",60,"2019-11-19",63,"2019-11-26",65,"2019-12-03",68,"2019-12-10",70,"2019-12-17",71,"2020-01-07",72,"2020-01-14",75,"2020-01-21",77,"2020-01-28",79,"2020-02-04",82,"2020-02-12",84,"2020-02-17",88,"2020-02-24",90,"2020-03-02",91,"2020-03-09",91,"2020-03-16",90,"2020-03-23",95,"2020-03-30",96,"2020-04-03",100,"2020-04-07",103,"2020-04-13",106,"2020-04-20",109,"2020-04-27",112,"2020-05-04",115,"2020-05-11",118,"2020-05-18",121,"2020-05-18",124,"2020-05-26",127,"2020-06-01",130]
[6,null,"Student ","F ","Oral Reading Fluency",3,50,"2019-12-16",1.1000000000000001,"2019-12-16",null,"2019-09-17",35,"2019-09-24",36,"2019-10-01",37,"2019-10-08",38,"2019-10-15",39,"2019-10-22",40,"2019-10-29",41,"2019-11-05",42,"2019-11-12",43,"2019-11-19",44,"2019-12-03",46,"2019-12-10",47," "]
[7,null,"Student ","G","Oral Reading Fluency",8,84,"2019-12-20",0.8,"2019-12-20",null,"2019-09-12",74,"2019-09-19",75,"2019-09-26",75,"2019-10-03",75,"2019-10-11",76,"2019-10-18",76,"2019-10-25",77]
[8,null,null,"  "]
[9,null," "]
[10]
[11]
[12]
[13]
[14]
[15]
[16]
[17]
[18]
{"$rows_left_out":15}
{"sheet":"Events","index":2,"n_rows":174,"n_cols":4,"rows_kept":174,"cut":false,"hidden":false,"merged":[]}
["Student","Event #","Event Date","Event Description"]
[{"$f":"CONCATENATE('Data Entry'!D3,\" \",'Data Entry'!C3)","v":"A Student "},1,"2019-09-26","Intervention A2"]
[null,2,"2020-03-03","Changed Scoring"]
[null,3,"2020-04-22","Event 101.3"]
[null,4]
[null,5]
[]
["Student","Event #","Event Date","Event Description"]
[{"$f":"CONCATENATE('Data Entry'!D4,\" \",'Data Entry'!C4)","v":"B Student "},1,"2019-09-12","Event 1"]
[null,2,"2019-12-12","Event 1B"]
[null,3,"2020-04-07","Event 5"]
[null,4]
[null,5]
[]
["Student","Event #","Event Date","Event Description"]
[{"$f":"CONCATENATE('Data Entry'!D5,\" \",'Data Entry'!C5)","v":"C Student "},1,"2020-01-08","ARD Meeting"]
[null,2,"2020-02-20","ARD Meeting"]
[null,3," "," "]
[null,4]
[null,5]
{"$rows_left_out":155}
{"sheet":"Graph","index":3,"n_rows":340,"n_cols":29,"rows_kept":340,"cut":false,"hidden":false,"merged":[]}
[]
[]
[null,null,null,null,null,null,null,null,null,null,null,null,null,null,null,null,null,null,null,"Dates","Actual","Benchmark","ROI","Trend","Event 1","Event 2","Event 3","Event 4","Event 5"]
[null,null,null,null,null,null,null,null,null,null,null,null,null,null,null,null,null,null,null,"2019-09-10",5,5,5,5,{"$error":"#N/A"},{"$error":"#N/A"},{"$error":"#N/A"},{"$error":"#N/A"},5]
[null,null,null,null,null,null,null,null,null,null,null,null,null,null,null,null,null,null,null,"2019-09-17",6,{"$f":"IF(ISNUMBER(#REF!),#REF!,NA())","v":{"$error":"#N/A"}},{"$f":"IF(ISNUMBER(#REF!),#REF!,NA())","v":{"$error":"#N/A"}},{"$error":"#N/A"},{"$error":"#N/A"},{"$error":"#N/A"},{"$error":"#N/A"},{"$error":"#N/A"},{"$error":"#N/A"}]
[null,null,null,null,null,null,null,null,null,null,null,null,null,null,null,null,null,null,null,"2019-09-24",7,{"$f":"IF(ISNUMBER(#REF!),#REF!,NA())","v":{"$error":"#N/A"}},{"$f":"IF(ISNUMBER(#REF!),#REF!,NA())","v":{"$error":"#N/A"}},{"$error":"#N/A"},{"$error":"#N/A"},{"$error":"#N/A"},{"$error":"#N/A"},{"$error":"#N/A"},{"$error":"#N/A"}]
[null,null,null,null,null,null,null,null,null,null,null,null,null,null,null,null,null,null,null,"2019-10-01",7,{"$f":"IF(ISNUMBER(#REF!),#REF!,NA())","v":{"$error":"#N/A"}},{"$f":"IF(ISNUMBER(#REF!),#REF!,NA())","v":{"$error":"#N/A"}},{"$error":"#N/A"},{"$error":"#N/A"},{"$error":"#N/A"},{"$error":"#N/A"},{"$error":"#N/A"},{"$error":"#N/A"}]
[null,null,null,null,null,null,null,null,null,null,null,null,null,null,null,null,null,null,null,"2019-10-04",8,{"$f":"IF(ISNUMBER(#REF!),#REF!,NA())","v":{"$error":"#N/A"}},{"$f":"IF(ISNUMBER(#REF!),#REF!,NA())","v":{"$error":"#N/A"}},{"$error":"#N/A"},{"$error":"#N/A"},{"$error":"#N/A"},{"$error":"#N/A"},{"$error":"#N/A"},{"$error":"#N/A"}]
[null,null,null,null,null,null,null,null,null,null,null,null,null,null,null,null,null,null,null,"2019-10-11",9,{"$f":"IF(ISNUMBER(#REF!),#REF!,NA())","v":{"$error":"#N/A"}},{"$f":"IF(ISNUMBER(#REF!),#REF!,NA())","v":{"$error":"#N/A"}},{"$error":"#N/A"},{"$error":"#N/A"},{"$error":"#N/A"},{"$error":"#N/A"},{"$error":"#N/A"},{"$error":"#N/A"}]
[null,null,null,null,null,null,null,null,null,null,null,null,null,null,null,null,null,null,null,"2019-10-18",11,{"$f":"IF(ISNUMBER(#REF!),#REF!,NA())","v":{"$error":"#N/A"}},{"$f":"IF(ISNUMBER(#REF!),#REF!,NA())","v":{"$error":"#N/A"}},{"$error":"#N/A"},{"$error":"#N/A"},{"$error":"#N/A"},{"$error":"#N/A"},{"$error":"#N/A"},{"$error":"#N/A"}]
[null,null,null,null,null,null,null,null,null,null,null,null,null,null,null,null,null,null,null,"2019-10-22",12,{"$f":"IF(ISNUMBER(#REF!),#REF!,NA())","v":{"$error":"#N/A"}},{"$f":"IF(ISNUMBER(#REF!),#REF!,NA())","v":{"$error":"#N/A"}},{"$error":"#N/A"},{"$error":"#N/A"},{"$error":"#N/A"},{"$error":"#N/A"},{"$error":"#N/A"},{"$error":"#N/A"}]
[null,null,null,null,null,null,null,null,null,null,null,null,null,null,null,null,null,null,null,"2019-10-29",13,{"$f":"IF(ISNUMBER(#REF!),#REF!,NA())","v":{"$error":"#N/A"}},{"$f":"IF(ISNUMBER(#REF!),#REF!,NA())","v":{"$error":"#N/A"}},{"$error":"#N/A"},{"$error":"#N/A"},{"$error":"#N/A"},{"$error":"#N/A"},{"$error":"#N/A"},{"$error":"#N/A"}]
[null,null,null,null,null,null,null,null,null,null,null,null,null,null,null,null,null,null,null,"2019-11-05",13,{"$f":"IF(ISNUMBER(#REF!),#REF!,NA())","v":{"$error":"#N/A"}},{"$f":"IF(ISNUMBER(#REF!),#REF!,NA())","v":{"$error":"#N/A"}},{"$error":"#N/A"},{"$error":"#N/A"},{"$error":"#N/A"},{"$error":"#N/A"},{"$error":"#N/A"},{"$error":"#N/A"}]
[null,null,null,null,null,null,null,null,null,null,null,null,null,null,null,null,null,null,null,"2019-11-12",14,{"$f":"IF(ISNUMBER(#REF!),#REF!,NA())","v":{"$error":"#N/A"}},{"$f":"IF(ISNUMBER(#REF!),#REF!,NA())","v":{"$error":"#N/A"}},{"$error":"#N/A"},{"$error":"#N/A"},{"$error":"#N/A"},{"$error":"#N/A"},{"$error":"#N/A"},{"$error":"#N/A"}]
[null,null,null,null,null,null,null,null,null,null,null,null,null,null,null,null,null,null,null,"2019-11-19",15,{"$f":"IF(ISNUMBER(#REF!),#REF!,NA())","v":{"$error":"#N/A"}},{"$f":"IF(ISNUMBER(#REF!),#REF!,NA())","v":{"$error":"#N/A"}},{"$error":"#N/A"},{"$error":"#N/A"},{"$error":"#N/A"},{"$error":"#N/A"},{"$error":"#N/A"},{"$error":"#N/A"}]
[null,null,null,null,null,null,null,null,null,null,null,null,null,null,null,null,null,null,null,"2019-11-26",17,{"$f":"IF(ISNUMBER(#REF!),#REF!,NA())","v":{"$error":"#N/A"}},{"$f":"IF(ISNUMBER(#REF!),#REF!,NA())","v":{"$error":"#N/A"}},{"$error":"#N/A"},{"$error":"#N/A"},{"$error":"#N/A"},{"$error":"#N/A"},{"$error":"#N/A"},{"$error":"#N/A"}]
[null,null,null,null,null,null,null,null,null,null,null,null,null,null,null,null,null,null,null,"2019-12-03",18,{"$f":"IF(ISNUMBER(#REF!),#REF!,NA())","v":{"$error":"#N/A"}},{"$f":"IF(ISNUMBER(#REF!),#REF!,NA())","v":{"$error":"#N/A"}},{"$error":"#N/A"},{"$error":"#N/A"},{"$error":"#N/A"},{"$error":"#N/A"},{"$error":"#N/A"},{"$error":"#N/A"}]
[null,null,null,null,null,null,null,null,null,null,null,null,null,null,null,null,null,null,null,"2019-12-10",18,{"$f":"IF(ISNUMBER(#REF!),#REF!,NA())","v":{"$error":"#N/A"}},{"$f":"IF(ISNUMBER(#REF!),#REF!,NA())","v":{"$error":"#N/A"}},{"$error":"#N/A"},{"$error":"#N/A"},{"$error":"#N/A"},{"$error":"#N/A"},{"$error":"#N/A"},{"$error":"#N/A"}]
[null,null,null,null,null,null,null,null,null,null,null,null,null,null,null,null,null,null,null,"2019-12-17",19,{"$f":"IF(ISNUMBER(#REF!),#REF!,NA())","v":{"$error":"#N/A"}},{"$f":"IF(ISNUMBER(#REF!),#REF!,NA())","v":{"$error":"#N/A"}},{"$error":"#N/A"},{"$error":"#N/A"},{"$error":"#N/A"},{"$error":"#N/A"},{"$error":"#N/A"},{"$error":"#N/A"}]
[null,null,null,null,null,null,null,null,null,null,null,null,null,null,null,null,null,null,null,"2020-01-07",17,{"$f":"IF(ISNUMBER(#REF!),#REF!,NA())","v":{"$error":"#N/A"}},{"$f":"IF(ISNUMBER(#REF!),#REF!,NA())","v":{"$error":"#N/A"}},{"$error":"#N/A"},{"$error":"#N/A"},{"$error":"#N/A"},{"$error":"#N/A"},{"$error":"#N/A"},{"$error":"#N/A"}]
{"$rows_left_out":321}
{"sheet":"Score Summary","index":4,"n_rows":10,"n_cols":8,"rows_kept":10,"cut":false,"hidden":false,"merged":[]}
["Student","Group","Measure Utilized","Baseline Score","Estimate of Current Level","Observed ROI","ROI Trend","Benchmark Trend"]
["Student , A",null,"Computation",6,41,0.97735849056603785,"On Track","Off Track"]
["Student , B",1,"Maze",10.666666666666666,46.333333333333336,1,"On Track"]
["Student , C",1,"Maze",5.666666666666667,29,0.65789473684210531,null,"On Track"]
["Student , D"," ","Digit Span",4.333333333333333,27.333333333333332,0.63396226415094348,null,"Off Track"]
["Student , E",null,"Oral Reading Fluency",46.666666666666664,127,2.2452830188679247,"On Track","On Track"]
["Student , F ",null,"Oral Reading Fluency",36,45.666666666666664,1,"Off Track","Off Track"]
["Student , G",null,"Oral Reading Fluency",74.666666666666671,76.333333333333329,0.48837209302325579,"Off Track","Off Track"]
[]
[" "]

{"sheet":"Lookup","index":5,"n_rows":22,"n_cols":29,"rows_kept":22,"cut":false,"hidden":false,"merged":[[2,4,2,8],[17,0,17,25],[21,0,21,25]]}
[]
["Oral Reading Fluency"]
["   Select Grade",null,null,null,"Benchmark",null,null,null,null,null,null,null,null,null,null,null,null,null,null,null,null,null,null,null,null,null,null,null,1]
[null,null,null,null,"%ile","Fall","Winter","Spring","Avg Weekly Improvement",null,null,null,null,null,null,null,null,null,null,null,null,null,null,null,null,null,6,null,2]
[null,null,null,null,90,{"$f":"IF(INDEX(Fall_Benchmark_ORF,MATCH(Grade&90,Grades_ORF&Percentiles_ORF,0))=\"\",\"\",INDEX(Fall_Benchmark_ORF,MATCH(Grade&90,Grades_ORF&Percentiles_ORF,0)))","v":185},{"$f":"INDEX(Winter_Benchmark_ORF,MATCH(Grade&90,Grades_ORF&Percentiles_ORF,0))","v":195},{"$f":"INDEX(Spring_Benchmark_ORF,MATCH(Grade&90,Grades_ORF&Percentiles_ORF,0))","v":204},{"$f":"INDEX(Avg_Weekly_Improvement_ORF,MATCH(Grade&90,Grades_ORF&Percentiles_ORF,0))","v":0.6},null,null,null,null,null,null,null,null,null,null,null,null,null,null,null,null,null,null,null,3]
[null,null,null,null,75,{"$f":"IF(INDEX(Fall_Benchmark_ORF,MATCH(Grade&75,Grades_ORF&Percentiles_ORF,0))=\"\",\"\",INDEX(Fall_Benchmark_ORF,MATCH(Grade&75,Grades_ORF&Percentiles_ORF,0)))","v":159},{"$f":"INDEX(Winter_Benchmark_ORF,MATCH(Grade&75,Grades_ORF&Percentiles_ORF,0))","v":166},{"$f":"INDEX(Spring_Benchmark_ORF,MATCH(Grade&75,Grades_ORF&Percentiles_ORF,0))","v":173},{"$f":"INDEX(Avg_Weekly_Improvement_ORF,MATCH(Grade&75,Grades_ORF&Percentiles_ORF,0))","v":0.4},null,null,null,null,null,null,null,null,null,null,null,null,null,null,null,null,null,null,null,4]
[null,null,null,null,50,{"$f":"IF(INDEX(Fall_Benchmark_ORF,MATCH(Grade&50,Grades_ORF&Percentiles_ORF,0))=\"\",\"\",INDEX(Fall_Benchmark_ORF,MATCH(Grade&50,Grades_ORF&Percentiles_ORF,0)))","v":132},{"$f":"INDEX(Winter_Benchmark_ORF,MATCH(Grade&50,Grades_ORF&Percentiles_ORF,0))","v":145},{"$f":"INDEX(Spring_Benchmark_ORF,MATCH(Grade&50,Grades_ORF&Percentiles_ORF,0))","v":146},{"$f":"INDEX(Avg_Weekly_Improvement_ORF,MATCH(Grade&50,Grades_ORF&Percentiles_ORF,0))","v":0.4},null,null,null,null,null,null,null,null,null,null,null,null,null,null,null,null,null,null,null,5]
[null,null,null,null,25,{"$f":"IF(INDEX(Fall_Benchmark_ORF,MATCH(Grade&25,Grades_ORF&Percentiles_ORF,0))=\"\",\"\",INDEX(Fall_Benchmark_ORF,MATCH(Grade&25,Grades_ORF&Percentiles_ORF,0)))","v":112},{"$f":"INDEX(Winter_Benchmark_ORF,MATCH(Grade&25,Grades_ORF&Percentiles_ORF,0))","v":116},{"$f":"INDEX(Spring_Benchmark_ORF,MATCH(Grade&25,Grades_ORF&Percentiles_ORF,0))","v":122},{"$f":"INDEX(Avg_Weekly_Improvement_ORF,MATCH(Grade&25,Grades_ORF&Percentiles_ORF,0))","v":0.3},null,null,null,null,null,null,null,null,null,null,null,null,null,null,null,null,null,null,null,6]
[null,null,null,null,10,{"$f":"IF(INDEX(Fall_Benchmark_ORF,MATCH(Grade&10,Grades_ORF&Percentiles_ORF,0))=\"\",\"\",INDEX(Fall_Benchmark_ORF,MATCH(Grade&10,Grades_ORF&Percentiles_ORF,0)))","v":89},{"$f":"INDEX(Winter_Benchmark_ORF,MATCH(Grade&10,Grades_ORF&Percentiles_ORF,0))","v":91},{"$f":"INDEX(Spring_Benchmark_ORF,MATCH(Grade&10,Grades_ORF&Percentiles_ORF,0))","v":91},{"$f":"INDEX(Avg_Weekly_Improvement_ORF,MATCH(Grade&10,Grades_ORF&Percentiles_ORF,0))","v":0.1},null,null,null,null,null,null,null,null,null,null,null,null,null,null,null,null,null,null,null,7]
[null,null,null,null,null,null,null,null,null,null,null,null,null,null,null,null,null,null,null,null,null,null,null,null,null,null,null,null,8]
[]
[]
[]
[]
[]
["  Norms derived from:"]
[]
["  Hasbrouck, J. & Tindal, G. (2017). An update to compiled ORF norms (Technical Report No. 1702). Eugene, OR, Behavioral Research and Teaching, University of Oregon. https://www.brtprojects.org/wp-content/uploads/2017/10/TechRpt_1702ORFNorms_Fini.pdf"]
[]
["  and"]
{"$rows_left_out":3}
{"sheet":"Lookup ORF","index":6,"n_rows":41,"n_cols":6,"rows_kept":41,"cut":false,"hidden":true,"merged":[]}
["Grade","Percentile of Student","Fall Benchmark","Winter Benchmark","Spring Benchmark","Avg. Weekly Improvement"]
[1,90,null,97,116,1.2]
[1,75,null,59,91,2]
[1,50,null,29,60,1.9]
[1,25,null,16,34,1.1000000000000001]
[1,10,null,9,18,0.6]
[2,90,111,131,148,1.2]
[2,75,84,109,124,1.3]
[2,50,50,84,100,1.6]
[2,25,36,59,72,1.1000000000000001]
[2,10,23,35,43,0.6]
[3,90,134,161,166,1]
[3,75,104,137,139,1.1000000000000001]
[3,50,83,97,112,0.9]
[3,25,59,79,91,1]
[3,10,40,62,63,0.7]
[4,90,153,168,184,1]
[4,75,125,143,160,1.1000000000000001]
[4,50,94,120,133,1.2]
[4,25,75,95,105,0.9]
{"$rows_left_out":21}